Verkeer en vervoer
type: Concept
narrower: Verkeersdeelname

CBS begrip
label: CBS concept @en

Verkeersdeelname
type: Concept
type: CBS begrip
created: 2016-03-23T09:19:33Z
modified: 2022-02-23T15:56:01Z
source: verkeersdeelname
version info: 1
broader: Verkeer en vervoer
definition: Het aandeel personen dat zich op een bepaalde dag op de openbare weg begeeft.
in scheme: Begrippen CBS
scope note: Dit kan als voetganger of als gebruiker (bestuurder of passagier) van een vervoermiddel.

Begrippen CBS
type: ConceptScheme
preferred label: Concepts Statistics Netherlands @en