Bedrijven
type: Concept
narrower: Overige bedrijfsopbrengsten

CBS begrip
label: CBS concept @en

Overige bedrijfsopbrengsten
type: Concept
type: CBS begrip
created: 2016-03-23T09:12:52Z
modified: 2022-02-23T15:54:51Z
source: overige-bedrijfsopbrengsten
version info: 1
broader: Bedrijven
definition: Bedrijfsopbrengsten die niet behoren tot de netto-omzet.
definition: Revenues that are not part of net turnover. @en
in scheme: Begrippen CBS
preferred label: Other revenues @en
related: Bedrijfsopbrengsten
scope note: Het gaat hier met name om: - de waarde van voorraadmutaties, incl. onderhanden werk; - vergoedingen voor uitgeleend personeel; - geactiveerde productie voor het eigen bedrijf; - subsidies en exportrestituties; - schade-uitkeringen.

Bedrijfsopbrengsten
type: Concept
type: CBS begrip
preferred label: Operating returns @en
related: Overige bedrijfsopbrengsten

Begrippen CBS
type: ConceptScheme
preferred label: Concepts Statistics Netherlands @en