Arbeid en sociale zekerheid
type: Concept
narrower: Oproepkracht

CBS begrip
label: CBS concept @en

Oproepkracht
type: Concept
type: CBS begrip
created: 2016-03-23T09:05:11Z
modified: 2022-02-23T15:54:47Z
source: oproepkracht
version info: 1
broader: Arbeid en sociale zekerheid
definition: Werknemer die op oproep of afroep beschikbaar is voor het verrichten van werkzaamheden en met wie geen vaste arbeidsduur is overeengekomen.
definition: Employee who is available for work on call and who does not have a fixed number of working hours. @en
in scheme: Begrippen CBS
preferred label: Worker on call @en
scope note: Oproepkrachten worden ook wel aangeduid als afroep- of invalkrachten.

Begrippen CBS
type: ConceptScheme
preferred label: Concepts Statistics Netherlands @en