Natuur en milieu
type: Concept
narrower: Dagrecreatief terrein

CBS begrip
label: CBS concept @en

Dagrecreatief terrein
type: Concept
type: CBS begrip
created: 2016-03-23T09:07:37Z
modified: 2022-02-23T15:53:10Z
source: dagrecreatief-terrein
version info: 1
broader: Natuur en milieu
definition: Terrein in gebruik voor dagrecreatie zoals dierentuinen, openluchtmusea en pretparken.
definition: Area used for daytime recreation, such as zoos, open air museums, and amusement parks. @en
in scheme: Begrippen CBS
preferred label: Area for daytime recreation @en
related: Classificatie Bodemgebruik
scope note: Tot dagrecreatief terrein wordt gerekend: - dagcamping; - dierentuin en safaripark; - sprookjestuin; - pretpark; - openluchtmuseum; - jachthavens excl. het water, maar inclusief terrein voor aanverwante bedrijvigheid, met een minimale oppervlakte van 0,1 ha; - bijbehorende parkeerterreinen en bos- of heesterstroken. De volgende terreinen worden eveneens tot deze categorie gerekend als ze geen deel uitmaken van park en plantsoen: - speeltuinen; - picknickplaatsen; - hertenkampen; - kinderboerderijen; - midgetgolfterreinen; - speelweiden.

Classificatie Bodemgebruik
type: Concept
type: CBS begrip
preferred label: Land use, classification @en
related: Dagrecreatief terrein

Begrippen CBS
type: ConceptScheme
preferred label: Concepts Statistics Netherlands @en