Bouwen en wonen
type: Concept
narrower: Stedelijkheid (van een gebied)

CBS begrip
label: CBS concept @en

Stedelijkheid (van een gebied)
type: Concept
type: CBS begrip
created: 2016-03-23T09:05:41Z
modified: 2022-02-23T15:55:36Z
source: stedelijkheid--van-een-gebied--
version info: 1
broader: Bouwen en wonen
definition: The classification of surrounding address density based on five categories: - extremely urbanised: 2,500 addresses or more per square kilometre; - strongly urbanised: 1,500 to 2,000 addresses per square kilometre; - moderately urbanised: 1,000 to 1,500 @en
definition: Een maatstaf voor de concentratie van menselijke activiteiten gebaseerd op de gemiddelde omgevingsadressendichtheid (oad). Hierbij zijn vijf categorieën onderscheiden: - zeer sterk stedelijk: gemiddelde oad van 2500 of meer adressen per km2; - sterk stedelijk: gemiddelde oad van 1500 tot 2500 adressen per km2; - matig stedelijk: gemiddelde oad van 1000 tot 1500 adressen per km2; - weinig stedelijk: gemiddelde oad van 500 tot 1000 adressen per km2; - niet stedelijk: gemiddelde oad van minder dan 500 adressen per km2.
in scheme: Begrippen CBS
preferred label: Degree of urbanisation @en
related: Omgevingsadressendichtheid van een adres
scope note: Onder omgevingsadressendichtheid wordt verstaan het aantal adressen binnen een cirkel met een straal van één kilometer rondom een adres, gedeeld door de oppervlakte van de cirkel. Bij de indeling naar stedelijkheid zijn numerieke waarden van de gemiddelde omgevingsadressendichtheid voor afzonderlijke gebieden gecategoriseerd in vijf groepen of klassen. De klassengrenzen van de verschillende categorieën stedelijkheid worden toegepast met ingang van 1992 en zijn zo gekozen dat alle klassen ongeveer hetzelfde aantal inwoners bevatten. De gemiddelde omgevingsadressendichtheid van een gebied is het gemiddelde van de omgevingsadressendichtheden van alle adressen in dat gebied. De omgevingsadressendichtheid wordt uitgedrukt in adressen per km2.

Omgevingsadressendichtheid van een adres
type: Concept
type: CBS begrip
preferred label: Surrounding address density @en
related: Stedelijkheid (van een gebied)

Begrippen CBS
type: ConceptScheme
preferred label: Concepts Statistics Netherlands @en