Macro-economie
type: Concept
narrower: Lonen

CBS begrip
label: CBS concept @en

Lonen
type: Concept
type: CBS begrip
created: 2016-03-23T09:04:49Z
modified: 2023-03-29T15:52:14Z
source: lonen-en-salarissen--nr--
version info: 2
broader: Macro-economie
definition: The compensation for the employee who has worked in a given period and which is payable by the employer, including the wage tax and social premiums paid by the employer on behalf of the employee. @en
definition: De vergoedingen voor de werknemer, die in een bepaalde periode arbeid verricht, en die ten laste komen van de werkgever. Dit is inclusief de door de werkgever ingehouden loonbelasting en de sociale premies die ten laste komen van de werknemer.
history note: De definitie is aangepast. Het voorgaande begrip was: lonen en salarissen.
in scheme: Begrippen CBS
note: Vorige definitie: De vergoedingen voor de werknemer, die in een bepaalde periode arbeid verricht, en die ten laste komen van de werkgever, inclusief de door de werkgever ingehouden loonbelasting en de sociale premies die ten laste komen van de werknemer. Definitie volgens
preferred label: Wages and salaries according to National accounts @en
related: Loonkosten
scope note: Naast het periodieke, direct aan werknemers betaalde loon bevatten de lonen en salarissen ook aanvullingen hierop (zoals gratificaties, overwerkvergoeding, fooien en provisie), het loon in natura (zoals vrij wonen, vrije voeding, 'auto van de zaak', korting op kinderopvang, rentevoordeel en voordelig reizen) en het vakantiegeld. Ook bepaalde vergoedingen voor kosten die door werknemers zijn gemaakt in verband met de dienstbetrekking, zoals vergoeding voor de kosten van het woon-werkverkeer, worden tot de lonen gerekend. De loonbetaling over uren die een werknemer wegens ziekteverzuim niet werkt wordt overgeheveld naar de 'sociale premies ten laste van werkgevers'.

Loonkosten
type: Concept
type: CBS begrip
preferred label: Labour costs @en
related: Lonen

Begrippen CBS
type: ConceptScheme
preferred label: Concepts Statistics Netherlands @en