Onderwijs
type: Concept
narrower: Standaard Onderwijsindeling 1998

CBS begrip
label: CBS concept @en

Standaard Onderwijsindeling 1998
type: Concept
type: CBS begrip
created: 2016-03-23T09:05:39Z
modified: 2022-02-23T15:55:34Z
source: standaard-onderwijsindeling-1998--soi-1998--
subject: https://taxonomie.cbs.nl/vocab/id/2502
version info: 1
alternative label: SOI 1998
broader: Onderwijs
definition: De door het CBS vanaf 1998 gehanteerde indeling van opleidingen naar niveau en naar richting, ontwikkeld voor gebruik bij statistiek en onderzoek en voor administratieve doeleinden in Nederland.
definition: The classification of educational programs by level and field used by Statistics Netherlands since 1998 developed for use in statistics and research and for administrative purposes in the Netherlands. @en
in scheme: Begrippen CBS
preferred label: Dutch Standard Classification of Education (SOI) 1998 @en
related: Sector alpha (onderwijs)
related: Behaald onderwijsniveau
related: Onderwijssector SOI 2006
related: Sector sociaal (onderwijs)
related: Sector beta (onderwijs)
scope note: De SOI-code bestaat uit zes cijfers die zo gedetailleerd mogelijk niveau en richting van een opleiding coderen. De eerste twee cijfers geven het niveau (1-7) respectievelijk het subniveau (0-3) van een opleiding aan. Uit de volgende vier cijfers kan de richting van een opleiding worden afgeleid: sector, subsector, rubrieksgroep en rubriek. Omdat er voortdurend opleidingen bijkomen, wordt deze indeling jaarlijks geactualiseerd. Qua structuur sluit de SOI 1998 niet meer volledig aan bij de in 1997 gereviseerde ISCED, de internationale onderwijsindeling van de UNESCO. In de SOI 1998 is niveau 4 (2e fase voortgezet onderwijs) voor het eerst onderverdeeld in drie subniveaus. Zie www.cbs.nl/nl-NL/menu/methoden/classificaties/overzicht/soi/default.htm voor gedetailleerde informatie over de SOI-1998.

Behaald onderwijsniveau
type: Concept
type: CBS begrip
preferred label: Highest completed education level @en
related: Standaard Onderwijsindeling 1998

Sector alpha (onderwijs)
type: Concept
type: CBS begrip
related: Standaard Onderwijsindeling 1998

Sector beta (onderwijs)
type: Concept
type: CBS begrip
related: Standaard Onderwijsindeling 1998

Onderwijssector SOI 2006
type: Concept
type: CBS begrip
preferred label: Educational sector SOI @en
related: Standaard Onderwijsindeling 1998

Sector sociaal (onderwijs)
type: Concept
type: CBS begrip
related: Standaard Onderwijsindeling 1998

Begrippen CBS
type: ConceptScheme
preferred label: Concepts Statistics Netherlands @en