Onderwijs
type: Concept
narrower: Leerling kunstzinnige vorming

CBS begrip
label: CBS concept @en

Leerling kunstzinnige vorming
type: Concept
type: CBS begrip
created: 2016-03-23T09:11:42Z
modified: 2022-02-23T15:54:13Z
source: leerling-kunstzinnige-vorming
version info: 1
broader: Onderwijs
definition: Een persoon die zich heeft ingeschreven voor een cursus kunstzinnige vorming van meer dan twintig weken.
definition: Someone who has signed up for a course in the arts of more than twenty weeks. @en
in scheme: Begrippen CBS
preferred label: Arts student @en

Begrippen CBS
type: ConceptScheme
preferred label: Concepts Statistics Netherlands @en