Veiligheid en recht
type: Concept
narrower: Gemeengevaarlijk misdrijf

CBS begrip
label: CBS concept @en

Gemeengevaarlijk misdrijf
type: Concept
type: CBS begrip
created: 2016-03-23T09:14:51Z
modified: 2022-02-23T15:53:35Z
source: gemeengevaarlijk-misdrijf
version info: 1
broader: Veiligheid en recht
definition: Misdrijf tegen de openbare orde, omschreven in artikel 157 en 158 Wetboek van Strafrecht.
in scheme: Begrippen CBS
scope note: Het gaat om (schuld aan) brandstichting, ontploffing of overstroming.

Begrippen CBS
type: ConceptScheme
preferred label: Concepts Statistics Netherlands @en