Diensten
type: Concept
narrower: Sector verzekeringsinstellingen en pensioenfondsen

CBS begrip
label: CBS concept @en

Verzekeringsinstellingen en pensioenfondsen
type: Concept
type: CBS begrip
preferred label: Insurance corporations @en
related: Sector verzekeringsinstellingen en pensioenfondsen

Institutionele sector
type: Concept
type: CBS begrip
preferred label: Institutional sector @en
related: Sector verzekeringsinstellingen en pensioenfondsen

Sector verzekeringsinstellingen en pensioenfondsen
type: Concept
type: CBS begrip
created: 2016-03-23T09:05:59Z
modified: 2022-02-23T15:55:23Z
source: sector-verzekeringsinstellingen-en-pensioenfondsen
version info: 1
broader: Diensten
definition: Subsector van de institutionele sector financiële instellingen. Deze subsector omvat alle (quasi-)vennootschappen met als hoofdfunctie het omzetten van individuele risico's in collectieve risico's. Hieronder vallen de pensioen- en spaarfondsen, levens- en schadeverzekeringsmaatschappijen, spaar- en jaarkassen en herverzekeringsmaatschappijen, die onder toezicht van De Nederlandsche Bank staan. Ook de pensioenfondsen en verzekeringsmaatschappijen die niet onder toezicht van De Nederlandsche Bank staan, zoals VUT-fondsen, behoren tot deze subsector.
definition: Sub sector of the financial corporations sector. This sub sector consists of enterprises with a legal form such as limited companies, foundations etc. that mainly engage in changing individual into collective risks. They do not include the legal social in @en
in scheme: Begrippen CBS
preferred label: Sector insurance corporations @en
related: Institutionele sector
related: Financiële instellingen
related: Sector overheid
related: Verzekeringsinstellingen en pensioenfondsen
scope note: Het toezicht op pensioenfondsen en verzekeraars wordt sinds oktober 2004 uitgeoefend door De Nederlandsche Bank. Voordien werd het toezicht uitgeoefend door de Pensioen- & Verzekeringskamer, een voortzetting van de Verzekeringskamer. Herverzekeringsmaatschappijen vallen met ingang van 1-1-2008 ook onder het toezicht van De Nederlandsche Bank. Met de invoering van de zorgverzekeringswet per 1-1-2006 zijn de meeste particulier georganiseerde sociale verzekeringsinstellingen opgeheven. Deze instellingen, zoals het voormalige Risicofonds voor de bouwnijverheid (t/m 2007) en diverse ziektekostenregelingen voor specifieke beroepsgroepen (bijvoorbeeld voor gemeenteambtenaren en politiepersoneel), voerden sociale verzekeringsregelingen uit buiten de invloedssfeer van de overheid.

Financiële instellingen
type: Concept
type: CBS begrip
preferred label: Sector financial corporations @en
related: Sector verzekeringsinstellingen en pensioenfondsen

Sector overheid
type: Concept
type: CBS begrip
preferred label: Sector general government @en
related: Sector verzekeringsinstellingen en pensioenfondsen

Begrippen CBS
type: ConceptScheme
preferred label: Concepts Statistics Netherlands @en