Arbeid en sociale zekerheid
type: Concept
narrower: Sociale premies

CBS begrip
label: CBS concept @en

Sociale premies
type: Concept
type: CBS begrip
created: 2016-03-23T09:10:24Z
modified: 2023-03-29T15:52:14Z
source: sociale-premies
version info: 2
broader: Arbeid en sociale zekerheid
definition: Premies wettelijke sociale verzekering, pensioenpremies, overige particuliere sociale premies en toegerekende sociale premies. Deze premies komen ten laste van werkgevers, werknemers, zelfstandigen en niet-werkenden.
definition: The contributions paid to social security. These include imputed and actual social premiums and actual pension premiums. @en
in scheme: Begrippen CBS
preferred label: Social contributions @en
related: Sociale premies ten laste van werkgevers
scope note: In de praktijk wordt het werkgeversdeel van deze premies rechtstreeks door de werkgevers aan de verzekeraars betaald. Omdat de werkgeverspremies ook deel uit maken van de loonkosten zijn zij in eerste aanleg behandeld als beloning van werknemers aan huishoudens. Vanuit de huishoudens vloeien ze daarna, samen met de premies die niet ten laste komen van werkgevers, naar de verzekeraars.

Sociale premies ten laste van werkgevers
type: Concept
type: CBS begrip
preferred label: Employers' social contributions @en
related: Sociale premies

Begrippen CBS
type: ConceptScheme
preferred label: Concepts Statistics Netherlands @en