Natuur en milieu
type: Concept
narrower: Delfstofwinplaats

CBS begrip
label: CBS concept @en

Delfstofwinplaats
type: Concept
type: CBS begrip
created: 2016-03-23T09:07:34Z
modified: 2022-02-23T15:53:12Z
source: delfstofwinplaats
version info: 1
broader: Natuur en milieu
definition: Terrein voor het winnen van grondstoffen uit de bodem.
definition: Area used for extracting minerals from the soil. @en
in scheme: Begrippen CBS
preferred label: Area for the extraction of minerals @en
related: Classificatie Bodemgebruik
scope note: Tot delfstofwinplaats wordt gerekend: - terrein voor diepte- en oppervlakwinning van grondstoffen; - de tot dat terrein behorende gebouwen, parkeergelegenheden, opslagplaatsen van winningsproducten en afvalstoffen; - bijbehorende parkeerterreinen. Water met een oppervlakte van meer dan 1 ha liggend binnen een delfstofwinplaats wordt gerekend tot de categorie “binnenwater voor delfstofwinning”. Bij delfstofwinplaatsen worden tot grondstoffen gerekend: - aardgas; - aardolie; - gesteente; - grind; - klei; - leem; - mergel; - veen; - zand. Winplaatsen van aardgas en aardolie zijn op de topografische kaart in de regel met een afrastering afgebakend. Als begrenzing van een object wordt dan de afrastering aangehouden.

Classificatie Bodemgebruik
type: Concept
type: CBS begrip
preferred label: Land use, classification @en
related: Delfstofwinplaats

Begrippen CBS
type: ConceptScheme
preferred label: Concepts Statistics Netherlands @en