Bevolking
type: Concept
narrower: Gemiddelde bevolking

CBS begrip
label: CBS concept @en

Gemiddelde bevolking
type: Concept
type: CBS begrip
created: 2016-03-23T09:11:00Z
modified: 2022-02-23T15:53:37Z
source: gemiddelde-bevolking
version info: 1
broader: Bevolking
definition: De helft van een bevolking aan het begin van een bepaalde periode plus de helft van die bevolking aan het eind van de periode.
definition: Half of the population at the start of a given period plus half of the population at the end of that period. @en
in scheme: Begrippen CBS
preferred label: Average population @en
scope note: De gemiddelde bevolking wordt ook per leeftijd uitgerekend. Dit gebeurt voor de twee leeftijdsbegrippen op verschillende wijze: - Leeftijd op 31 december: De helft van de personen met een bepaald geboortejaar aan het begin van een periode plus de helft van de personen met dat zelfde geboortejaar aan het einde van de periode. - Leeftijd op de laatste verjaardag: De helft van de personen van een bepaald leeftijd aan het begin van een periode plus de helft van de personen van gelijke leeftijd aan het einde van de periode.

Begrippen CBS
type: ConceptScheme
preferred label: Concepts Statistics Netherlands @en