Arbeid en sociale zekerheid
type: Concept
narrower: Pensioen

CBS begrip
label: CBS concept @en

Pensioen
type: Concept
type: CBS begrip
created: 2016-03-23T09:05:17Z
modified: 2022-02-23T15:54:56Z
source: pensioen
version info: 1
broader: Arbeid en sociale zekerheid
definition: Periodieke uitkering die mensen ontvangen na ontslag uit een baan of betrekking wegens het bereiken van een vooraf vastgestelde leeftijd of wegens overlijden van de partner.
definition: A regular payment of benefits to replace or supplement income from work. The benefits are paid after reaching a certain age, death or disablement. @en
in scheme: Begrippen CBS
preferred label: Pension @en
related: Aanvullend pensioen
scope note: Voorbeelden van pensioen zijn ouderdomspensioen, nabestaandenpensioen en invaliditeitspensioen.

Aanvullend pensioen
type: Concept
type: CBS begrip
preferred label: Pension supplement @en
related: Pensioen

Begrippen CBS
type: ConceptScheme
preferred label: Concepts Statistics Netherlands @en