Verkeer en vervoer
type: Concept
narrower: Nulvervoer

CBS begrip
label: CBS concept @en

Nulvervoer
type: Concept
type: CBS begrip
created: 2016-03-23T09:08:03Z
modified: 2022-02-23T15:54:36Z
source: nulvervoer
version info: 1
broader: Verkeer en vervoer
definition: Hiervan is sprake indien de respondent op de enquêtedag geen verplaatsingen heeft gemaakt.
in scheme: Begrippen CBS

Begrippen CBS
type: ConceptScheme
preferred label: Concepts Statistics Netherlands @en