Verkeer en vervoer
type: Concept
narrower: Vaarwegbeheerder

CBS begrip
label: CBS concept @en

Vaarwegbeheerder
type: Concept
type: CBS begrip
created: 2016-03-23T09:14:16Z
modified: 2022-02-23T15:55:54Z
source: vaarwegbeheerder
version info: 1
broader: Verkeer en vervoer
definition: De instantie die verantwoordelijk is voor het beheer en het onderhoud van een vaarweg. Onderscheiden worden: Rijk, provincies, waterschappen, gemeenten, havenbedrijven, particuliere beheerders.
in scheme: Begrippen CBS

Begrippen CBS
type: ConceptScheme
preferred label: Concepts Statistics Netherlands @en