Macro-economie
type: Concept
narrower: Bezettingsgraad machines/installaties

CBS begrip
label: CBS concept @en

Bezettingsgraad machines/installaties
type: Concept
type: CBS begrip
created: 2016-03-23T09:08:10Z
modified: 2022-02-23T15:52:46Z
source: bezettingsgraad-machines-installaties
version info: 1
broader: Macro-economie
definition: De mate waarin de productiemiddelen door de ondernemingen worden benut.
definition: The degree to which a company used its means of production. @en
in scheme: Begrippen CBS
preferred label: Degree of capacity utilisation of machinery/installations @en

Begrippen CBS
type: ConceptScheme
preferred label: Concepts Statistics Netherlands @en