Natuur en milieu
type: Concept
narrower: Begraafplaats

CBS begrip
label: CBS concept @en

Classificatie Bodemgebruik
type: Concept
type: CBS begrip
preferred label: Land use, classification @en
related: Begraafplaats

Begraafplaats
type: Concept
type: CBS begrip
created: 2016-03-23T09:07:33Z
modified: 2022-02-23T15:52:37Z
source: begraafplaats
version info: 1
broader: Natuur en milieu
definition: Terrein in gebruik voor begraven en cremeren.
definition: Area used to bury and cremate the dead. @en
in scheme: Begrippen CBS
preferred label: Cemetery @en
related: Classificatie Bodemgebruik
scope note: Tot begraafplaats wordt gerekend: - terrein voor het begraven van mensen of dieren; - crematorium; - bijbehorende gebouwen, parken, tuinen, parkeerterreinen en bos- of heesterstroken.

Begrippen CBS
type: ConceptScheme
preferred label: Concepts Statistics Netherlands @en