Bevolking
type: Concept
narrower: Vruchtbare leeftijd

CBS begrip
label: CBS concept @en

Vruchtbare leeftijd
type: Concept
type: CBS begrip
created: 2016-03-23T09:06:09Z
modified: 2022-02-23T15:56:18Z
source: vruchtbare-leeftijd
version info: 1
broader: Bevolking
definition: De leeftijdscategorie van 15 tot 50 jaar bij vrouwen.
definition: The stage of life in which a woman is biologically capable of having children, barring exceptions. The period used for this phase in life is generally the 15 to 50 age bracket. @en
in scheme: Begrippen CBS
preferred label: Fertile age @en
scope note: De levensfase van de vrouw waarin zij, behoudens uitzonderingen, biologisch in staat is kinderen te baren.

Begrippen CBS
type: ConceptScheme
preferred label: Concepts Statistics Netherlands @en