Arbeid en sociale zekerheid
type: Concept
narrower: CAO-sector

CBS begrip
label: CBS concept @en

Institutionele sector
type: Concept
type: CBS begrip
preferred label: Institutional sector @en
related: CAO-sector

CAO-sector
type: Concept
type: CBS begrip
created: 2016-03-23T09:04:05Z
modified: 2022-02-23T15:53:00Z
source: cao-sector
version info: 1
broader: Arbeid en sociale zekerheid
definition: Alle bedrijven en instellingen die actief zijn in Nederland zijn ingedeeld in een CAO-sector. De indeling in CAO-sectoren is gebaseerd op de positie van de werknemers bij de arbeidsvoorwaardenonderhandelingen. Er worden drie CAO-sectoren onderscheiden: particuliere bedrijven, overheid en de gesubsidieerde instellingen.
definition: All enterprises and institutions active in the Netherlands are included in a collective labour agreement (CAO in Dutch) sector. The division into CAO sectors is based on the position of employees in the negotiations on working conditions. There are three @en
in scheme: Begrippen CBS
preferred label: Collective labour agreement sector (CAO sector) @en
related: Institutionele sector
related: CAO-sector overheid
related: CAO-sector gesubsidieerde instellingen
related: CAO-sector particuliere bedrijven
scope note: De CAO-sectorindeling wijkt af van de indeling in institutionele sectoren zoals die in de Nationale rekeningen wordt gehanteerd.

CAO-sector particuliere bedrijven
type: Concept
type: CBS begrip
preferred label: Collective labour agreement sector private companies @en
related: CAO-sector

CAO-sector gesubsidieerde instellingen
type: Concept
type: CBS begrip
preferred label: Collective labour agreement sector subsidised corporations @en
related: CAO-sector

CAO-sector overheid
type: Concept
type: CBS begrip
preferred label: Collective labour agreement sector government @en
related: CAO-sector

Begrippen CBS
type: ConceptScheme
preferred label: Concepts Statistics Netherlands @en