Onderwijs
type: Concept
narrower: Voortgezet onderwijs

CBS begrip
label: CBS concept @en

Voortgezet onderwijs
type: Concept
type: CBS begrip
created: 2016-03-23T09:06:06Z
modified: 2022-02-23T15:56:16Z
source: voortgezet-onderwijs
version info: 1
broader: Onderwijs
definition: Het voortgezet onderwijs omvat het voorbereidend wetenschappelijk onderwijs (vwo), het hoger algemeen voortgezet onderwijs (havo), het voorbereidend middelbaar beroepsonderwijs (vmbo) en het praktijkonderwijs.
definition: Collective term for the first year of high school, special secondary education, secondary general education (havo, vwo), and prevocational training (vmbo, lwoo). @en
in scheme: Begrippen CBS
preferred label: Secondary education (VO) @en
related: Voorbereidend wetenschappelijk onderwijs
related: Hoger algemeen voortgezet onderwijs
related: Voorbereidend middelbaar beroepsonderwijs
related: Praktijkonderwijs
related: Leerweg ondersteunend onderwijs
scope note: Het vwo, havo, vmbo en praktijkonderwijs vallen onder de Wet op het voortgezet onderwijs (WVO). Het vwo is vooral bedoeld als vooropleiding voor het wetenschappelijk onderwijs en omvat zes leerjaren. Tot het vwo behoren de onderwijssoorten gymnasium (klassieke talen verplicht) en atheneum (klassieke talen als keuzevak). De havo bereidt voor op het hoger beroepsonderwijs en heeft vijf leerjaren. Gediplomeerde havisten kunnen ook doorstromen naar het vijfde leerjaar van het vwo. Zowel bij het vwo als havo kunnen de leerlingen in de hogere leerjaren kiezen uit vier profielen: natuur en techniek, natuur en gezondheid, economie en maatschappij en cultuur en maatschappij. Elk profiel bevat gemeenschappelijke (profielonafhankelijke) vakken, verplichte (profielspecifieke) vakken en vrije vakken. Leerlingen kunnen ook een combinatie van profielen kiezen. Het vmbo bereidt voor op het middelbaar beroepsonderwijs (mbo), heeft een duur van vier jaar en kent vier onderwijsprogramma’s, leerwegen genoemd, die een voorgeschreven aantal vakken en een relatief vaststaand examenpakket hebben. Leerlingen kunnen kiezen uit de theoretische, de gemengde, de kaderberoepsgerichte en de basisberoepsgerichte leerweg. ● De theoretische leerweg geeft toegang tot een middenkaderopleiding (niveau 4) in het mbo. Geslaagden voor deze onderwijssoort kunnen ook doorstromen naar het vierde leerjaar havo. ● De gemengde leerweg is te beschouwen als een tussenvorm van de theoretische leerweg en de kaderberoepsgerichte leerweg, heeft hetzelfde niveau als de theoretische leerweg, maar heeft ook een beroepsgericht vak. De gemengde leerweg geeft toegang tot een middenkaderopleiding (niveau 4) van het mbo en afhankelijk van de school tot het vierde leerjaar havo. ● De kaderberoepsgerichte leerweg is de beroepsgerichte vooropleiding voor de vakopleiding (niveau 3) en de middenkaderopleiding (niveau 4) van het mbo. ● De basisberoepsgerichte leerweg is bedoeld als vooropleiding voor de basisberoepsopleiding (nive…

Hoger algemeen voortgezet onderwijs
type: Concept
type: CBS begrip
related: Voortgezet onderwijs

Leerweg ondersteunend onderwijs
type: Concept
type: CBS begrip
preferred label: Learning support department @en
related: Voortgezet onderwijs

Voorbereidend wetenschappelijk onderwijs
type: Concept
type: CBS begrip
related: Voortgezet onderwijs

Voorbereidend middelbaar beroepsonderwijs
type: Concept
type: CBS begrip
preferred label: Prevocational secondary education @en
related: Voortgezet onderwijs

Praktijkonderwijs
type: Concept
type: CBS begrip
preferred label: Practical training @en
related: Voortgezet onderwijs

Begrippen CBS
type: ConceptScheme
preferred label: Concepts Statistics Netherlands @en