Veiligheid en recht
type: Concept
narrower: Dagvaarding

CBS begrip
label: CBS concept @en

Dagvaarding
type: Concept
type: CBS begrip
created: 2016-03-23T09:04:11Z
modified: 2022-02-23T15:53:10Z
source: dagvaarding
version info: 1
broader: Veiligheid en recht
definition: Officieel geschrift dat iemand oproept op een bepaalde tijd voor de rechter te verschijnen in verband met het beslechten van een geschil (burgerlijk recht), of de vervolging van een strafbaar feit (strafrecht).
definition: Official document (writ) summoning a person to appear in court to settle a conflict (civil procedure) or to go on trial on criminal charges (criminal procedure) @en
in scheme: Begrippen CBS
preferred label: Summons @en
related: Burgerlijk recht
related: Strafrecht
related: Eindvonnis, burgerlijk recht

Eindvonnis, burgerlijk recht
type: Concept
type: CBS begrip
preferred label: Final court judgement @en
related: Dagvaarding

Strafrecht
type: Concept
type: CBS begrip
related: Dagvaarding

Burgerlijk recht
type: Concept
type: CBS begrip
preferred label: Civil law @en
related: Dagvaarding

Begrippen CBS
type: ConceptScheme
preferred label: Concepts Statistics Netherlands @en