Verkeer en vervoer
type: Concept
narrower: Duwboot

CBS begrip
label: CBS concept @en

Duwboot
type: Concept
type: CBS begrip
created: 2016-03-23T09:12:11Z
modified: 2022-02-23T15:53:18Z
source: duwboot
version info: 1
broader: Verkeer en vervoer
definition: Motorschip met een vermogen van ten minste 37 kW, dat is ontworpen of aangepast om duwbakken of duwsleepschepen te duwen, maar niet om zelf goederen te vervoeren.
definition: Motor boat with a capacity of at least 37 kW, designed or refitted to push barges or tug boats, but not to transport freight. @en
in scheme: Begrippen CBS
preferred label: Push boat @en

Begrippen CBS
type: ConceptScheme
preferred label: Concepts Statistics Netherlands @en