Onderwijs
type: Concept
narrower: Onderwijsrichting ISCED

CBS begrip
label: CBS concept @en

Onderwijsrichting ISCED
type: Concept
type: CBS begrip
created: 2016-03-23T09:08:09Z
modified: 2022-06-14T07:55:23Z
source: onderwijsrichting-isced
subject: https://taxonomie.cbs.nl/vocab/id/2493
subject: https://taxonomie.cbs.nl/vocab/id/2639
version info: 1
alternative label: Studierichting
broader: Onderwijs
definition: De International Standard Classification of Education Fields of Training and Education 2013 (ISCED-F 2013) is de international classificatie voor het indelen van het onderwijs naar richting van de UNESCO.
definition: The place of educational programs in the ISCED classification based on thematic content. @en
in scheme: Begrippen CBS
preferred label: Field of education ISCED @en
scope note: ISCED-F 2013 is ontworpen als een 3-traps hiërarchische richtingindeling in broad, narrow en detailed fields. Van broad naar detailed fields neemt het detail toe. Er worden 11 broad fields, 32 narrow fields en 93 detailed fields onderscheiden. Voor de Nederlandse toepassing van deze classificatie worden daarvoor de termen hoofdgroepen, subgroepen en detailgroepen gehanteerd. De nationale variant van de ISCED-F 2013 die is ontwikkeld in het kader van de revisie van de SOI 2006 voorziet in een extra aggregatieniveau: de rubrieken. Richting in de ISCED-F 2013 is onafhankelijk van niveau, en wordt dus niet binnen een niveau gedefinieerd en is op alle vormen van onderwijs en onderwijsniveaus toepasbaar. De richting van het onderwijs heeft betrekking op de inhoud/studierichting van het onderwijs, niet op de denominatie van de onderwijsinstelling of op de soort onderwijsinstelling of onderwijsmethode. Bij het inrichten van de structuur van de ISCED-F 2013 is gekeken naar de mate waarin de richting van het onderwijs overeenkomt. In volgorde van prioriteit zijn hierbij de volgende criteria toegepast: de inhoud van de theoretische kennis, het doel van de kennis die overgedragen wordt, de onderwerpen die worden onderwezen, de leermethode (bijvoorbeeld gericht op een specifieke leeftijdsgroep) en de manier waarop de kennis en vaardigheden worden verkregen en de instrumenten die de student leert te gebruiken. Opleidingen worden aan de verschillende richtingen toegedeeld op grond van het belangrijkste vakinhoudelijke onderwerp (subject matter content in termen van de ISCED-F 2013). Om praktische redenen wordt er dan uitgegaan van het onderwerp waaraan door de deelnemer de meeste tijd moet worden besteed. Dit is dus de formele studieduur en die kan afwijken van de tijd die er door de individuele student aan wordt besteed.

Begrippen CBS
type: ConceptScheme
preferred label: Concepts Statistics Netherlands @en