Vrije tijd en cultuur
type: Concept
narrower: Slaapplaats in logiesaccommodaties

CBS begrip
label: CBS concept @en

Slaapplaats in logiesaccommodaties
type: Concept
type: CBS begrip
created: 2016-03-23T09:12:27Z
modified: 2022-02-23T15:55:25Z
source: slaapplaats-in-logiesaccommodaties
version info: 1
broader: Vrije tijd en cultuur
definition: Ieder bed of ruimte in een logiesaccommodatie waar één persoon kan slapen.
definition: Every bed or other space in an accommodation where one person can sleep. Double beds are counted as two sleeping places. @en
in scheme: Begrippen CBS
preferred label: Sleeping place (in accommodation) @en
scope note: Alle eenpersoonsbedden of andere eenpersoonsslaapplaatsen in hotels en pensions worden als één slaapplaats geteld; tweepersoonsbedden worden als twee slaapplaatsen geteld. Bijzetbedden in hotels en bedden in dependances worden niet meegeteld. Bij huisjesterreinen en groepsaccommodaties worden alle eenpersoonsbedden of andere eenpersoonsslaapplaatsen als één slaapplaats geteld; tweepersoonsbedden worden als twee slaapplaatsen geteld. Slaapplaatsen in vast verhuurde huisjes of bungalows tellen niet mee. Op kampeerterreinen telt een standplaats voor vijf slaapplaatsen. Slaapplaatsen op vaste standplaatsen tellen niet mee.

Begrippen CBS
type: ConceptScheme
preferred label: Concepts Statistics Netherlands @en