Industrie en energie
type: Concept
narrower: Steenkoolproducten

CBS begrip
label: CBS concept @en

Steenkoolproducten
type: Concept
type: CBS begrip
created: 2016-03-23T09:18:08Z
modified: 2022-02-23T15:55:36Z
source: steenkoolproducten
version info: 1
broader: Industrie en energie
definition: Van kool afgeleide producten zoals steenkoolcokes en hoogovengas.
definition: From coal derived products like coke-oven cokes and blast furnace gas. @en
in scheme: Begrippen CBS
preferred label: Coal products @en
scope note: Kool is een fossiele brandstof die bestaat uit verkoolde plantenresten.

Begrippen CBS
type: ConceptScheme
preferred label: Concepts Statistics Netherlands @en