Arbeid en sociale zekerheid
type: Concept
narrower: Niet-beroepsbevolking

CBS begrip
label: CBS concept @en

Potentiële beroepsbevolking
type: Concept
type: CBS begrip
preferred label: Working age population @en
related: Niet-beroepsbevolking

Beroepsbevolking
type: Concept
type: CBS begrip
preferred label: Labour force @en
related: Niet-beroepsbevolking

Niet-beroepsbevolking
type: Concept
type: CBS begrip
created: 2016-03-23T09:10:11Z
modified: 2022-02-23T15:54:32Z
source: niet-beroepsbevolking
version info: 1
broader: Arbeid en sociale zekerheid
definition: Personen zonder betaald werk, die niet recent naar werk hebben gezocht of daarvoor niet direct beschikbaar zijn.
definition: People who don't have paid work, who haven't recently looked for work of are not directly available for it. @en
in scheme: Begrippen CBS
preferred label: Not in the labour force @en
related: Potentiële beroepsbevolking
related: Beroepsbevolking
scope note: Deze definitie heeft betrekking op personen die in Nederland wonen (exclusief de institutionele bevolking). De gegevens worden meestal gepresenteerd voor de bevolking van 15 tot 75 jaar. Bij betaald werk gaat het om werkzaamheden ongeacht de arbeidsduur.

Begrippen CBS
type: ConceptScheme
preferred label: Concepts Statistics Netherlands @en