Arbeid en sociale zekerheid
type: Concept
narrower: Maandloon

CBS begrip
label: CBS concept @en

Maandloon
type: Concept
type: CBS begrip
created: 2016-03-23T09:04:54Z
modified: 2022-02-23T15:54:19Z
source: maandloon
version info: 1
broader: Arbeid en sociale zekerheid
definition: Het maandelijks betaalde brutoloon vóór aftrek van werknemerspremies voor pensioen en vut.
definition: The gross wage paid each month before deducting the pension and early retirement premiums paid by the employee. @en
in scheme: Begrippen CBS
preferred label: Monthly wages @en

Begrippen CBS
type: ConceptScheme
preferred label: Concepts Statistics Netherlands @en