Arbeid en sociale zekerheid
type: Concept
narrower: Loondispensatieregeling

CBS begrip
label: CBS concept @en

Loondispensatieregeling
type: Concept
type: CBS begrip
created: 2016-03-23T09:04:51Z
modified: 2022-02-23T15:54:17Z
source: loondispensatieregeling
version info: 1
broader: Arbeid en sociale zekerheid
definition: Regeling die een werkgever de mogelijkheid biedt een ontheffing te krijgen van de verplichting om het wettelijk minimumloon of het normale CAO-loon te betalen aan werknemers die ten gevolge van ziekte of gebreken duidelijk minder presteren.
definition: Regulation allowing employers to be exempt from having to pay the legal minimum wage or the normal collective labour agreement wage to employees who perform clearly below the required level due to illness or disability. @en
in scheme: Begrippen CBS
preferred label: Wage dispensation @en
scope note: Deze mogelijkheid is te vinden in de Wet op de (re)integratie arbeidsgehandicapten.

Begrippen CBS
type: ConceptScheme
preferred label: Concepts Statistics Netherlands @en