Industrie en energie
type: Concept
narrower: Normaal gelood

CBS begrip
label: CBS concept @en

Normaal gelood
type: Concept
type: CBS begrip
created: 2016-03-23T09:18:25Z
modified: 2022-02-23T15:54:36Z
source: normaal-gelood
version info: 1
broader: Industrie en energie
definition: Loodhoudende motorbenzine met een octaangetal kleiner dan 95.
definition: Leaded motor gasoline with an octane rating of less than 95. @en
in scheme: Begrippen CBS
preferred label: Normal leaded @en
scope note: Er zijn gegevens over de periode 1946-1988. Hierna bevatte normaal motorbenzine zeer weinig tot geen lood meer.

Begrippen CBS
type: ConceptScheme
preferred label: Concepts Statistics Netherlands @en