Arbeid en sociale zekerheid
type: Concept
narrower: Sociale uitkeringen in geld

CBS begrip
label: CBS concept @en

Sociale uitkeringen in geld
type: Concept
type: CBS begrip
created: 2016-03-23T09:10:26Z
modified: 2022-02-23T15:55:28Z
source: sociale-uitkeringen-in-geld
version info: 1
broader: Arbeid en sociale zekerheid
definition: Uitkeringen in geld op grond van wettelijke sociale verzekering, sociale voorziening, pensioenvoorziening, overige particuliere sociale premies en uitkeringen rechtstreeks door werkgevers.
definition: Benefits paid by social insurance institutions, financed by premiums (unemployment, disability, sickness, old age). @en
in scheme: Begrippen CBS
preferred label: Social benefits in cash @en
scope note: Deze uitkeringen worden aan huishoudens toegekend om de financiële lasten te verlichten die voor die huishoudens voortvloeien uit een aantal risico’s en behoeften (zoals ziekte, invaliditeit, arbeidsongeschiktheid, ouderdom, nabestaanden en werkloosheid).

Begrippen CBS
type: ConceptScheme
preferred label: Concepts Statistics Netherlands @en