Bedrijven
type: Concept
narrower: Netto omzet

CBS begrip
label: CBS concept @en

Netto omzet
type: Concept
type: CBS begrip
created: 2016-03-23T09:09:00Z
modified: 2022-02-23T15:54:38Z
source: omzet-netto
version info: 1
broader: Bedrijven
definition: Opbrengst (excl. btw) uit verkoop van goederen en levering van diensten aan derden.
definition: Business returns, excluding VAT (value added taxes) from the selling of goods and services to customers. Turnover is calculated after deduction of discounts, bonuses, returnabledeposits and on-charged freight costs @en
in scheme: Begrippen CBS
preferred label: Net turnover @en
scope note: Derden zijn particulieren dan wel bedrijven buiten het (Nederlandse deel van het) eigen concernverband. Waar van toepassing wordt de netto omzet vastgesteld na aftrek van kortingen, bonussen, statiegeld en doorberekende vrachtkosten

Begrippen CBS
type: ConceptScheme
preferred label: Concepts Statistics Netherlands @en