Bedrijven
type: Concept
narrower: Bedrijfskosten

CBS begrip
label: CBS concept @en

Bedrijfsresultaat
type: Concept
type: CBS begrip
preferred label: Operating results @en
related: Bedrijfskosten

Bedrijfskosten
type: Concept
type: CBS begrip
created: 2016-03-23T09:12:53Z
modified: 2022-02-23T15:52:35Z
source: bedrijfskosten
version info: 1
broader: Bedrijven
definition: The costs made to achieve the operating profits, that is the purchase value of the turnover, labour costs, and depreciation on assets, and other business expenditure. @en
definition: De kosten die zijn gemaakt om de bedrijfsopbrengsten te realiseren, te weten de inkoopwaarde van de omzet, de arbeidskosten (Productiestatistieken), de afschrijvingen op vaste activa en de zgn. overige bedrijfskosten.
in scheme: Begrippen CBS
preferred label: Operating costs @en
related: Bedrijfsopbrengsten
related: Bedrijfsresultaat
related: Overige bedrijfskosten

Bedrijfsopbrengsten
type: Concept
type: CBS begrip
preferred label: Operating returns @en
related: Bedrijfskosten

Overige bedrijfskosten
type: Concept
type: CBS begrip
preferred label: Other operating costs @en
related: Bedrijfskosten

Begrippen CBS
type: ConceptScheme
preferred label: Concepts Statistics Netherlands @en