Inkomen en bestedingen
type: Concept
narrower: Inkomen uit vermogen

CBS begrip
label: CBS concept @en

Primair inkomen
type: Concept
type: CBS begrip
preferred label: Primary income @en
related: Inkomen uit vermogen

Inkomen uit vermogen
type: Concept
type: CBS begrip
created: 2016-03-23T09:04:39Z
modified: 2022-02-23T15:53:55Z
source: inkomen-uit-vermogen
version info: 1
broader: Inkomen en bestedingen
definition: Rente over spaartegoeden, dividenden en opbrengsten uit onroerend goed (waaronder de eigen woning).
definition: Sum of the income from financial assets, income from real estate, and income from other property, minus interest paid. @en
in scheme: Begrippen CBS
preferred label: Income from wealth @en
related: Primair inkomen
scope note: Tot inkomsten uit financieel vermogen behoren ontvangen rente van banktegoeden, inkomsten uit obligaties en dividenden. Bij onroerend goed gaat het om inkomsten uit eigen woning en overige inkomsten uit onroerend goed. Betaalde rente (waaronder de hypotheekrente) is in mindering gebracht.

Begrippen CBS
type: ConceptScheme
preferred label: Concepts Statistics Netherlands @en