Verkeer en vervoer
type: Concept
narrower: Binnenvloot, actieve

CBS begrip
label: CBS concept @en

Binnenvloot, actieve
type: Concept
type: CBS begrip
created: 2016-03-23T09:09:08Z
modified: 2022-02-23T15:52:49Z
source: binnenvloot-actieve
version info: 1
broader: Verkeer en vervoer
definition: Alle schepen die in de loop van het desbetreffende verslagjaar hebben deelgenomen aan het binnenlandse en/of internationale vervoer via de binnenvaart.
definition: All vessels participating in national and/or international shipping on inland waterways in a given year. @en
in scheme: Begrippen CBS
preferred label: Active inland fleet @en

Begrippen CBS
type: ConceptScheme
preferred label: Concepts Statistics Netherlands @en