Onderwijs
type: Concept
narrower: Primair onderwijs

CBS begrip
label: CBS concept @en

Primair onderwijs
type: Concept
type: CBS begrip
created: 2016-03-23T09:08:40Z
modified: 2022-02-23T15:55:04Z
source: primair-onderwijs
version info: 1
broader: Onderwijs
definition: Het primair onderwijs omvat het basisonderwijs, het speciaal basisonderwijs en het onderwijs op speciale scholen.
definition: Education for children aged 4 to 12 after which they start secondary education. Until 1985 this was called pre-school and elementary school. It includes special needs education. @en
in scheme: Begrippen CBS
preferred label: Nursery school and primary education @en
scope note: Het basisonderwijs is bedoeld voor kinderen van 4 tot en met 12 jaar. Kinderen die meer hulp nodig hebben bij de opvoeding en het leren dan het basisonderwijs kan bieden, zijn aangewezen op het speciaal basisonderwijs. Deze onderwijssoort heeft doorgaans kleinere groepen leerlingen dan het basisonderwijs en beschikt over meer afzonderlijke deskundigen om de leerlingen met leer- en opvoedingsmoeilijkheden te begeleiden. Speciale scholen zijn bedoeld voor basis- en voortgezet onderwijs aan onder andere visueel gehandicapte kinderen, dove en slechthorende kinderen, lichamelijk gehandicapte kinderen, zeer moeilijk lerende of opvoedbare kinderen en langdurig zieke kinderen. Tot augustus 1998 was het primair onderwijs geregeld in twee wetten: de Wet op het Basisonderwijs (WBO) en de interimwet speciaal onderwijs en voortgezet speciaal onderwijs (ISOVSO). De WBO omvatte zowel het voormalige kleuteronderwijs als het voormalig lager onderwijs en maakte een eind aan het bestaan van aparte scholen voor kleuteronderwijs en voor lager onderwijs. De ISOVSO behelsde al het onderwijs aan kinderen die, bijvoorbeeld als gevolg van een verstandelijke, lichamelijke of zintuiglijke handicap, meer hulp nodig hadden bij de opvoeding en het leren dan het basisonderwijs of voortgezet onderwijs kon bieden. Het ging om:  kinderen met leer- en opvoedingsmoeilijkheden (lom; so en vso);  moeilijk lerende kinderen (mlk; so en vso);  in hun ontwikkeling bedreigde kleuters (iobk; alleen so);  zeer moeilijk lerende kinderen (zmlk; so en vso);  zeer moeilijk opvoedbare kinderen (zmok; so en vso);  dove kinderen (so en vso);  slechthorende kinderen (so en vso);  visueel gehandicapte kinderen (so en vso);  lichamelijk gehandicapte kinderen (so en vso);  meervoudig gehandicapte kinderen (so en vso);  langdurig zieke kinderen (so en vso);  kinderen met ernstige spraakmoeilijkheden (alleen so);  kinderen in scholen verbonden aan pedologische instituten (so en vso). Vanaf 1 augustus 1998 zijn …

Begrippen CBS
type: ConceptScheme
preferred label: Concepts Statistics Netherlands @en