Internationale handel
type: Concept
narrower: Handelsbalans

CBS begrip
label: CBS concept @en

Handelsbalans
type: Concept
type: CBS begrip
created: 2016-03-23T09:09:05Z
modified: 2022-02-23T15:53:46Z
source: handelsbalans
version info: 1
broader: Internationale handel
definition: Het saldo van de uitvoer en de invoer van goederen en diensten.
definition: The balance of the exports and imports of goods and services. @en
in scheme: Begrippen CBS
preferred label: Trade balance @en

Begrippen CBS
type: ConceptScheme
preferred label: Concepts Statistics Netherlands @en