Verkeer en vervoer
type: Concept
narrower: Openbaar vervoer

CBS begrip
label: CBS concept @en

Openbaar vervoer
type: Concept
type: CBS begrip
created: 2016-03-23T09:09:13Z
modified: 2022-02-23T15:54:44Z
source: openbaar-vervoer
version info: 1
broader: Verkeer en vervoer
definition: Vervoer volgens een dienstregeling met vastgestelde haltes en routes en dat door iedereen is te gebruiken.
definition: 'Transport provided according to a timetable with fixed stops and routes for use by the general public. @en
in scheme: Begrippen CBS
preferred label: Public transport @en

Begrippen CBS
type: ConceptScheme
preferred label: Concepts Statistics Netherlands @en