Veiligheid en recht
type: Concept
narrower: Derdelander

CBS begrip
label: CBS concept @en

Derdelander
type: Concept
type: CBS begrip
created: 2016-03-23T09:19:25Z
modified: 2022-02-23T15:53:13Z
source: derdelander
version info: 1
broader: Veiligheid en recht
definition: Persoon met een andere nationaliteit dan die van één van de lidstaten van de Europese Unie, Noorwegen, IJsland, Liechtenstein of Zwitserland.
in scheme: Begrippen CBS
scope note: Ook staatlozen worden tot derdelanders gerekend.

Begrippen CBS
type: ConceptScheme
preferred label: Concepts Statistics Netherlands @en