Arbeid en sociale zekerheid
type: Concept
narrower: Collectieve regelingen

CBS begrip
label: CBS concept @en

Collectieve regelingen
type: Concept
type: CBS begrip
created: 2016-03-23T09:04:06Z
modified: 2022-02-23T15:53:04Z
source: collectieve-regelingen
version info: 1
broader: Arbeid en sociale zekerheid
definition: This includes:- Collectively labour agreements (CAO in Dutch)Wages and other working conditions laid down by the Minister of Social Affairs and Employment;- Wages and other working conditions laid down by regulations approved by other public institutio @en
definition: Hieronder worden begrepen: - collectieve arbeidsovereenkomsten (CAO’s); - door de Minister van Sociale Zaken en Werkgelegenheid bindend vastgestelde regelingen van lonen en andere arbeidsvoorwaarden; - door publiekrechtelijke bedrijfsorganen vastgestelde verordeningen inzake lonen en andere arbeidsvoorwaarden; - regelingen van lonen en andere arbeidsvoorwaarden voor het overheidspersoneel.
in scheme: Begrippen CBS
preferred label: Collective agreements @en

Begrippen CBS
type: ConceptScheme
preferred label: Concepts Statistics Netherlands @en