Macro-economie
type: Concept
narrower: Werkelijke individuele consumptie

CBS begrip
label: CBS concept @en

Individuele consumptie door de overheid
type: Concept
type: CBS begrip
related: Werkelijke individuele consumptie

Werkelijke individuele consumptie
type: Concept
type: CBS begrip
created: 2016-03-23T09:06:11Z
modified: 2023-03-29T15:52:14Z
source: werkelijke-individuele-consumptie
version info: 2
broader: Macro-economie
definition: All expenditure on goods and services to satisfy individual human needs directly. This may be resident household or government spending. @en
definition: Alle uitgaven aan goederen en diensten die door een huishouden worden verworven en voor de bevrediging van de behoeften en wensen van leden van dat huishouden worden gebruikt.
history note: De definitie is aangepast
in scheme: Begrippen CBS
note: Vorige definitie: Alle uitgaven aan goederen en diensten die de rechtstreekse bevrediging van individuele menselijke behoeften tot doel hebben.
preferred label: Actual individual consumption @en
related: Individuele consumptie door de overheid
related: Consumptieve bestedingen door instellingen zonder winstoogmerk ten behoeve van huishoudens
scope note: De werkelijke individuele consumptie wijkt af van het begrip consumptieve bestedingen door huishoudens. Het verschil tussen deze begrippen zit in de goederen en diensten die door de overheid, of instellingen zonder winstoogmerk ten behoeve van huishoudens, worden gefinancierd, en vervolgens als sociale overdrachten in natura aan de huishoudens worden geleverd. Hieronder valt het merendeel van de uitgaven van de overheid op het gebied van gezondheid, onderwijs en sociale bescherming. De consumptie door instellingen zonder winstoogmerk ten behoeve van huishoudens wordt geheel tot de individuele consumptie gerekend. De werkelijke individuele consumptie door huishoudens wordt berekend als: de consumptieve bestedingen door huishoudens, plus de consumptieve bestedingen door instellingen zonder winstoogmerk ten behoeve van huishoudens, plus de individuele consumptie door de overheid.

Consumptieve bestedingen door instellingen zonder winstoogmerk ten behoeve van huishoudens
type: Concept
type: CBS begrip
preferred label: Consumption of non-profit institutions @en
related: Werkelijke individuele consumptie

Begrippen CBS
type: ConceptScheme
preferred label: Concepts Statistics Netherlands @en