Bouwen en wonen
type: Concept
narrower: Bebouwing

CBS begrip
label: CBS concept @en

Bebouwing
type: Concept
type: CBS begrip
created: 2016-03-23T09:06:30Z
modified: 2022-02-23T15:52:34Z
source: bebouwing
version info: 1
broader: Bouwen en wonen
definition: Alles wat gebouwd is en bestaat uit muren en een overkapping met een permanent karakter, bedoeld voor verblijf, handel, verkeer en/of arbeid. Kassen en opslagtanks zijn hierbij niet inbegrepen.
definition: Everything that is built and consists of walls and a roof, with a permanent character, intended for accommodation, trade, transport, and/or work. Not included are greenhouses and storage tanks. @en
in scheme: Begrippen CBS
preferred label: Buildings @en
related: Oppervlakte bebouwing
scope note: Afbakening van bebouwing gebeurt volgens opnamespecificaties van de digitale topografische kaart, schaal 1:10.000, van de Topografische Dienst Kadaster en bestaat uit de objecten 'gebouwen', 'bebouwd gebied' en 'hoogbouw'. De oppervlakte van bebouwing wordt berekend in het kader van de Financiële verhoudingswet (Fvw).

Oppervlakte bebouwing
type: Concept
type: CBS begrip
preferred label: Built-up area @en
related: Bebouwing

Begrippen CBS
type: ConceptScheme
preferred label: Concepts Statistics Netherlands @en