Natuur en milieu
type: Concept
narrower: Milieuheffing

CBS begrip
label: CBS concept @en

Milieuheffing
type: Concept
type: CBS begrip
created: 2016-03-23T09:13:59Z
modified: 2022-02-23T15:54:24Z
source: milieuheffing
version info: 1
broader: Natuur en milieu
definition: Heffing of belasting die direct verband houdt met milieubelastende activiteiten.
in scheme: Begrippen CBS

Begrippen CBS
type: ConceptScheme
preferred label: Concepts Statistics Netherlands @en