Macro-economie
type: Concept
narrower: Beurswaarde

CBS begrip
label: CBS concept @en

Beurswaarde
type: Concept
type: CBS begrip
created: 2016-03-23T09:08:30Z
modified: 2023-05-30T10:56:55
source: beurswaarde
subject: https://taxonomie.cbs.nl/vocab/id/2218
version info: 1
broader: Macro-economie
definition: De waardering van effecten op de beurs in geld.
definition: The value of a security on the stock exchange. @en
in scheme: Begrippen CBS
preferred label: Market value @en
scope note: De totale beurswaarde van aandelen is te berekenen als het product van het aantal genoteerde aandelen en de koers van het aandeel op een bepaald moment. De beurswaarde van obligaties is te berekenen als het product van het nominale genoteerde bedrag van de obligaties en de koers van de obligatie op een bepaald moment.

Begrippen CBS
type: ConceptScheme
preferred label: Concepts Statistics Netherlands @en