Macro-economie
type: Concept
narrower: Buitenlandrekening

CBS begrip
label: CBS concept @en

Buitenlandrekening
type: Concept
type: CBS begrip
created: 2023-03-29T09:17:24
version info: 1
broader: Macro-economie
definition: Systematisch overzicht van alle economische transacties in een bepaalde periode van niet-ingezetenen met Nederlandse ingezetenen, bezien vanuit het raamwerk van de nationale rekeningen.
in scheme: Begrippen CBS

Begrippen CBS
type: ConceptScheme
preferred label: Concepts Statistics Netherlands @en