Macro-economie
type: Concept
narrower: Structuureffect

CBS begrip
label: CBS concept @en

Structuureffect
type: Concept
type: CBS begrip
created: 2023-03-29T09:17:24
version info: 1
broader: Macro-economie
definition: Het verschil tussen de ontwikkeling van de loonkosten per gewerkt uur en de prijs van arbeid.
in scheme: Begrippen CBS

Begrippen CBS
type: ConceptScheme
preferred label: Concepts Statistics Netherlands @en