Internationale handel
type: Concept
narrower: Uitvoerhoeveelheid

CBS begrip
label: CBS concept @en

Uitvoerwaarde goederen (handel)
type: Concept
type: CBS begrip
preferred label: Export value of goods (trade) @en
related: Uitvoerhoeveelheid

Uitvoerhoeveelheid
type: Concept
type: CBS begrip
created: 2023-01-16T16:22:21Z
source: uitvoerhoeveelheid
subject: https://taxonomie.cbs.nl/vocab/id/1976
subject: https://taxonomie.cbs.nl/vocab/id/1993
version info: 1
broader: Internationale handel
definition: De hoeveelheid van de goederen die vanuit Nederland naar het buitenland gaan volgens de methode van fysieke grensoverschrijding.
definition: The quantity of goods that go abroad from the Netherlands according to the method of physical border crossing. @en
in scheme: Begrippen CBS
preferred label: Export quantity @en
related: Uitvoerwaarde goederen (handel)
scope note: Per goederensoort worden de hoeveelheden uitgedrukt in afgesproken eenheden op basis van de Gecombineerde Nomenclatuur (GN). Meestal is de eenheid ‘kilogram', maar er worden ook andere eenheden gebruikt zoals ‘stuks’ en ‘liter’.

Begrippen CBS
type: ConceptScheme
preferred label: Concepts Statistics Netherlands @en