Bedrijven
type: Concept
narrower: Buitengewone baten

CBS begrip
label: CBS concept @en

Buitengewoon resultaat
type: Concept
type: CBS begrip
preferred label: Exceptional result @en
related: Buitengewone baten

Buitengewone baten
type: Concept
type: CBS begrip
created: 2016-03-23T09:13:57Z
modified: 2022-02-23T15:52:57Z
source: buitengewone-baten
version info: 1
broader: Bedrijven
definition: De winsten die niet uit de eigenlijke bedrijfsvoering voortvloeien.
in scheme: Begrippen CBS
related: Buitengewoon resultaat
scope note: Als buitengewone baten worden o.a. beschouwd koerswinsten, positieve resultaten uit deelnemingen, buitenlandse vestigingen, beleggingen en termijnhandel. Voorts ook de vrijgevallen bedragen van de egalisatierekening voor de WIR-premies, de boekwinsten bij verkoop of tenietgaan van vaste activa en ontvangsten voor goodwill e.d.

Begrippen CBS
type: ConceptScheme
preferred label: Concepts Statistics Netherlands @en