Onderwijs
type: Concept
narrower: Voltijdonderwijs

CBS begrip
label: CBS concept @en

Opleidingsvorm
type: Concept
type: CBS begrip
related: Voltijdonderwijs

Voltijdonderwijs
type: Concept
type: CBS begrip
created: 2016-03-23T09:14:26Z
modified: 2022-02-23T15:56:13Z
source: voltijdonderwijs
version info: 1
broader: Onderwijs
definition: Dagonderwijs, dat op doordeweekse dagen wordt gegeven.
definition: Daytime education, provided on weekdays @en
in scheme: Begrippen CBS
preferred label: Full-time education @en
related: Opleidingsvorm
scope note: Meestal is er een wettelijk minimum aantal lesuren. Zo moeten basisscholen in acht opeenvolgende jaren minstens 7 520 uur les geven. Per leerjaar komt dit neer op een gemiddelde van minstens 940 uur. In het voortgezet onderwijs moeten de scholen in de onder- en bovenbouw minimaal 1 000 uur onderwijs per leerjaar aanbieden, met uitzondering van het examenjaar waarvoor een minimum van 700 uur les geldt. In het middelbaar beroepsonderwijs moet bij voltijdopleidingen per leerjaar minstens 850 uur onderwijs (lessen, stages en begeleiding) worden aangeboden. In het hoger onderwijs (hbo en wo) vallen de opleidingen die als dagonderwijs worden aangeboden onder het voltijdonderwijs.

Begrippen CBS
type: ConceptScheme
preferred label: Concepts Statistics Netherlands @en