Veiligheid en recht
type: Concept
narrower: Dagvaardingsformulier

CBS begrip
label: CBS concept @en

Dagvaardingsformulier
type: Concept
type: CBS begrip
created: 2016-03-23T09:14:46Z
modified: 2022-02-23T15:53:11Z
source: dagvaardingsformulier
version info: 1
broader: Veiligheid en recht
definition: Formulier om een procedure bij de kantonrechter te beginnen. Rechtzoekenden konden dit formulier zelf invullen. Deze voorziening is in 1991 ingevoerd om de toegang tot de rechter te vereenvoudigen en is per 1 januari 2002 afgeschaft.
in scheme: Begrippen CBS

Begrippen CBS
type: ConceptScheme
preferred label: Concepts Statistics Netherlands @en